[Lazarus] Error during building Lazarus from SVN on Ubuntu 7.10
Roland Turcan
konf at rotursoft.sk
Fri Mar 28 16:20:49 CET 2008
Thanks for your answer, but the problem was between chair and
keyboard.
I was calling "make" from subdirectory "ide" instead of "Lazarus' root"
one.
TRoland;
<<< 28.3.2008 15:42 - wile64 "wile64 at gmail.com" >>>
w> 2008/3/28, Roland Turcan <konf at rotursoft.sk>:
>> Hello General mailing list!
>>
>> I have this message
>>
>> ...
>> Compiling /usr/lib/lazarus/components/mpaslex/mpaslex.pp
>> tododlg.pas(60,38) Error: Identifier not found "TTodoItem"
>> tododlg.pas(63,1) Fatal: There were 1 errors compiling module, stopping
>> Fatal: Compilation aborted
>> make[2]: *** [lazarus] Error 1
>> make[2]: Leaving directory `/usr/lib/lazarus/ide'
>> make[1]: *** [ide] Error 2
>> make[1]: Leaving directory `/usr/lib/lazarus/ide'
>> make: *** [ide] Error 2
>>
>> ...but todolist.pas is in the same directory as tododlg.pas.
>>
>> What could it be?
>>
w> Search todolist.pp and tododlg.pp and delete it !
--
Best regards, TRoland
http://www.rotursoft.sk
http://exekutor.rotursoft.sk
More information about the Lazarus
mailing list