[Lazarus] Compilation failed At revision 41469.

Eric Kom erickom at metropolitancollege.co.za
Thu May 30 19:03:07 CEST 2013

Compilation failed At revision 41469.

$make bigide FPC=/usr/local/lib/fpc/2.7.1/ppc386
Free Pascal Compiler version 2.7.1 [2013/05/30] for i386
Copyright (c) 1993-2013 by Florian Klaempfl and others
Target OS: Linux for i386
Compiling lazbuild.lpr
lazbuild.lpr(922,37) Error: Wrong number of parameters specified for 
call to "ReadProject"
lazbuild.lpr(1624) Fatal: There were 1 errors compiling module, stopping
Fatal: Compilation aborted
make[2]: *** [lazbuild] Error 1
make[2]: Leaving directory `/home/erickom/freePascal27/lazarus/ide'
make[1]: *** [lazbuilder] Error 2
make[1]: Leaving directory `/home/erickom/freePascal27/lazarus/ide'
make: *** [lazbuild] Error 2

More information about the Lazarus mailing list