[Lazarus] Build error with fixes_3_0 and FPC current main (3.3.1)

Gabor Boros mlnglsts at bgss.hu
Sun Aug 20 08:23:03 CEST 2023

Hi All,

Free Pascal Compiler version 3.3.1 [2023/08/20] for x86_64
Copyright (c) 1993-2023 by Florian Klaempfl and others
(1002) Target OS: Win64 for x64
(3104) Compiling lazarus.pp
e:\Lazarus\fixes_3_0\ide\lazarus.pp(121,20) Warning: (5044) Symbol 
"MainFormOnTaskBar" is not portable
(9022) Compiling resource ..\units\x86_64-win64\win32\lazarus.obj
(9015) Linking ..\lazarus.exe
e:\Lazarus\fixes_3_0\ide\lazarus.pp(171,1) Error: (9221) Undefined 
(first seen in fpdebugvalueconvertors.o)
e:\Lazarus\fixes_3_0\ide\lazarus.pp(171,1) Fatal: (10026) There were 1 
errors compiling module, stopping
Fatal: (1018) Compilation aborted
make[2]: *** [lazarus.exe] Error 1
make[2]: Leaving directory `e:/Lazarus/fixes_3_0/ide'
make[1]: *** [ide] Error 2
make[1]: Leaving directory `e:/Lazarus/fixes_3_0/ide'
make: *** [ide] Error 2


More information about the lazarus mailing list